Target
cAMP-dependent protein kinase catalytic subunit alpha
Ligand
BDBM2702
Substrate
histone (type Vs)
Meas. Tech.
PKA assay
pH
8.5±n/a
Temperature
310.15±n/a K
IC50
1100±400 nM
Citation
 Bit, RADavis, PDElliott, LHHarris, WHill, CHKeech, EKumar, HLawton, GMaw, ANixon, JS Inhibitors of protein kinase C. 3. Potent and highly selective bisindolylmaleimides by conformational restriction. J Med Chem 36:21-9 (1993)  
Target
Name:
cAMP-dependent protein kinase catalytic subunit alpha
Synonyms:
KAPCA_BOVIN PKC Protein Kinase C cAMP-Dependent Protein Kinase (PKA) cAMP-dependent protein kinase A cAMP-dependent protein kinase, alpha-catalytic subunit
Type:
Enzyme Complex
Mol. Mass.:
40627.77
Organism:
Bos taurus (bovine)
Description:
The PKA holoenzyme purified from bovine heart, exists as an inactive tetrameric complex, which consists of a regulatory dimer associated with two catalytic subunits. It requires cAMP to activate the enzymatic reaction.
Residue:
351
  
Inhibitor
Name:
BDBM2702
Synonyms:
3-[3-(aminomethyl)-1H,2H,3H,4H-pyrido[1,2-a]indol-10-yl]-4-(1-methyl-1H-indol-3-yl)-2,5-dihydro-1H-pyrrole-2,5-dione | Bisindolylmaleimide deriv. 9d
Type:
Small organic molecule
Emp. Form.:
C26H24N4O2
Mol. Mass.:
424.4944
SMILES:
Cn1cc(C2=C(C(=O)NC2=O)c2c3CCC(CN)Cn3c3ccccc23)c2ccccc12
:
Substrate
Name:
histone (type Vs)
Synonyms:
Type:
Other Protein Type
Mol. Mass.:
358.43
Organism:
Description:
11 uM [gamma-32P]ATP as co-substrate.
Residue:
3
NA