Target
Caspase-7
Ligand
BDBM47551
Substrate
Meas. Tech.
Counterscreen for procaspase-3 activators: absorbance-based biochemical high throughput dose response assay for activators of procaspase-7
EC50
>85267±n/a nM
Citation
 PubChem, PC Counterscreen for procaspase-3 activators: absorbance-based biochemical high throughput dose response assay for activators of procaspase-7 PubChem Bioassay (2010)[AID] 
Target
Name:
Caspase-7
Synonyms:
Apoptotic protease Mch-3 CASP7 CMH-1 MCH3 | caspase 7, apoptosis-related cysteine peptidase
Type:
Enzyme
Mol. Mass.:
34273.91
Organism:
Homo sapiens (Human)
Description:
P55210
Residue:
303
  
Inhibitor
Name:
BDBM47551
Synonyms:
1-[(5S)-5-bicyclo[2.2.1]hept-2-enyl]-3-[[(E)-(3,5-dibromo-6-keto-cyclohexa-2,4-dien-1-ylidene)methyl]amino]thiourea 1-[(5S)-5-bicyclo[2.2.1]hept-2-enyl]-3-[[(E)-(3,5-dibromo-6-oxocyclohexa-2,4-dien-1-ylidene)methyl]amino]thiourea MLS000849875 SMR000455893 | cid_6708487
Type:
Small organic molecule
Emp. Form.:
C15H15Br2N3OS
Mol. Mass.:
445.172
SMILES:
[H]C12C[C@H](NC(=S)NN=Cc3cc(Br)cc(Br)c3O)C([H])(C1)C=C2
: