Target
RecBCD enzyme subunit RecD
Ligand
BDBM64731
Substrate
Meas. Tech.
Counterscreen for AddAB inhibitors: absorbance-based bacterial cell-based high throughput dose response assay to identify inhibitors of RecBCD
IC50
>118555±n/a nM
Citation
 PubChem, PC Counterscreen for AddAB inhibitors: absorbance-based bacterial cell-based high throughput dose response assay to identify inhibitors of RecBCD PubChem Bioassay (2010)[AID] 
Target
Name:
RecBCD enzyme subunit RecD
Synonyms:
RECD_ECOLI hopE | recD
Type:
Enzyme Catalytic Domain
Mol. Mass.:
66906.68
Organism:
Escherichia coli str. K-12 substr. MG1655
Description:
gi_16130723
Residue:
608
  
Inhibitor
Name:
BDBM64731
Synonyms:
MLS001212827 N-[[4-(diethylamino)phenyl]-(8-hydroxy-7-quinolyl)methyl]valeramide N-[[4-(diethylamino)phenyl]-(8-oxidanylquinolin-7-yl)methyl]pentanamide SMR000517138 | cid_2920952
Type:
Small organic molecule
Emp. Form.:
C25H31N3O2
Mol. Mass.:
405.5325
SMILES:
CCCCC(=O)NC(c1ccc(cc1)N(CC)CC)c1ccc2cccnc2c1O
: