Target
Short transient receptor potential channel 4
Ligand
BDBM77616
Substrate
Meas. Tech.
SAR Analysis for the identification of selective inhibits of the transient receptor potential cation channel C4 (TRPC4): Automated Electrophysiology
IC50
4560±n/a nM
Citation
 PubChem, PC SAR Analysis for the identification of selective inhibits of the transient receptor potential cation channel C4 (TRPC4): Automated Electrophysiology PubChem Bioassay (2010)[AID] 
Target
Name:
Short transient receptor potential channel 4
Synonyms:
TRPC4_MOUSE Trrp4 | alternatively spliced Trp4
Type:
Enzyme Catalytic Domain
Mol. Mass.:
111587.67
Organism:
Mus musculus
Description:
Q9QUQ5
Residue:
974
  
Inhibitor
Name:
BDBM77616
Synonyms:
4-chloranyl-N'-cyclohexyl-benzenecarboximidamide;hydrochloride 4-chloro-N'-cyclohexylbenzenecarboximidamide;hydrochloride MLS000663729 cid_2945295
Type:
Small organic molecule
Emp. Form.:
C13H17ClN2
Mol. Mass.:
236.74
SMILES:
NC(=NC1CCCCC1)c1ccc(Cl)cc1
: