Target
Short transient receptor potential channel 4
Ligand
BDBM77619
Substrate
Meas. Tech.
SAR Analysis for the identification of selective inhibits of the transient receptor potential cation channel C4 (TRPC4): Automated Electrophysiology
IC50
140000±n/a nM
Citation
 PubChem, PC SAR Analysis for the identification of selective inhibits of the transient receptor potential cation channel C4 (TRPC4): Automated Electrophysiology PubChem Bioassay (2010)[AID] 
Target
Name:
Short transient receptor potential channel 4
Synonyms:
TRPC4_MOUSE Trrp4 | alternatively spliced Trp4
Type:
Enzyme Catalytic Domain
Mol. Mass.:
111587.67
Organism:
Mus musculus
Description:
Q9QUQ5
Residue:
974
  
Inhibitor
Name:
BDBM77619
Synonyms:
4-(4-methyl-2-quinolinyl)morpholine;2,2,2-trifluoroacetic acid 4-(4-methylquinolin-2-yl)morpholine;2,2,2-trifluoroacetic acid VU0023528-4 | cid_46259334
Type:
Small organic molecule
Emp. Form.:
C14H16N2O
Mol. Mass.:
228.2896
SMILES:
Cc1cc(nc2ccccc12)N1CCOCC1
: