Target
Short transient receptor potential channel 4
Ligand
BDBM77620
Substrate
Meas. Tech.
SAR Analysis for the identification of selective inhibits of the transient receptor potential cation channel C4 (TRPC4): Automated Electrophysiology
IC50
3590±n/a nM
Citation
 PubChem, PC SAR Analysis for the identification of selective inhibits of the transient receptor potential cation channel C4 (TRPC4): Automated Electrophysiology PubChem Bioassay (2010)[AID] 
Target
Name:
Short transient receptor potential channel 4
Synonyms:
TRPC4_MOUSE Trrp4 | alternatively spliced Trp4
Type:
Enzyme Catalytic Domain
Mol. Mass.:
111587.67
Organism:
Mus musculus
Description:
Q9QUQ5
Residue:
974
  
Inhibitor
Name:
BDBM77620
Synonyms:
4-methyl-2-(1-pyrrolidinyl)quinoline;2,2,2-trifluoroacetic acid 4-methyl-2-pyrrolidin-1-ylquinoline;2,2,2-trifluoroacetic acid VU0324728-2 | cid_46259336
Type:
Small organic molecule
Emp. Form.:
C14H16N2
Mol. Mass.:
212.2902
SMILES:
Cc1cc(nc2ccccc12)N1CCCC1
: