Target
Voltage-dependent T-type calcium channel subunit alpha-1H
Ligand
BDBM36879
Substrate
Meas. Tech.
Inhibitors of T-Type Calcium Channels
EC50
2460±n/a nM
Citation
 PubChem, PC Inhibitors of T-Type Calcium Channels PubChem Bioassay (2011)[AID] 
Target
Name:
Voltage-dependent T-type calcium channel subunit alpha-1H
Synonyms:
CAC1H_HUMAN Low-voltage-activated calcium channel alpha1 3.2 subunit Voltage-gated calcium channel voltage-dependent T-type calcium channel subunit alpha-1H isoform a
Type:
Enzyme Catalytic Domain
Mol. Mass.:
259187.68
Organism:
Homo sapiens (Human)
Description:
Calcium channel (Type T,L) 0 0::O95180
Residue:
2353
  
Inhibitor
Name:
BDBM36879
Synonyms:
4-[3-(4-Fluoro-phenyl)-[1,2,4]oxadiazol-5-yl]-piperidine-1-carboxylic acid (3-trifluoromethyl-phenyl)-amide 4-[3-(4-fluorophenyl)-1,2,4-oxadiazol-5-yl]-N-[3-(trifluoromethyl)phenyl]piperidine-1-carboxamide SMR000007429 | cid_656125
Type:
Small organic molecule
Emp. Form.:
C21H18F4N4O2
Mol. Mass.:
434.3868
SMILES:
Fc1ccc(cc1)-c1noc(n1)C1CCN(CC1)C(=O)Nc1cccc(c1)C(F)(F)F
: