Target
Voltage-dependent T-type calcium channel subunit alpha-1H
Ligand
BDBM77127
Substrate
Meas. Tech.
Inhibitors of T-Type Calcium Channels
EC50
2346±n/a nM
Citation
 PubChem, PC Inhibitors of T-Type Calcium Channels PubChem Bioassay (2011)[AID] 
Target
Name:
Voltage-dependent T-type calcium channel subunit alpha-1H
Synonyms:
CAC1H_HUMAN Low-voltage-activated calcium channel alpha1 3.2 subunit Voltage-gated calcium channel voltage-dependent T-type calcium channel subunit alpha-1H isoform a
Type:
Enzyme Catalytic Domain
Mol. Mass.:
259187.68
Organism:
Homo sapiens (Human)
Description:
Calcium channel (Type T,L) 0 0::O95180
Residue:
2353
  
Inhibitor
Name:
BDBM77127
Synonyms:
1-N-benzyl-4-N-cyclopentyl-4-N-(pyridin-2-ylmethyl)benzene-1,4-disulfonamide MLS000123474 N4-cyclopentyl-N1-(phenylmethyl)-N4-(2-pyridinylmethyl)benzene-1,4-disulfonamide SMR000124056 | cid_1176979
Type:
Small organic molecule
Emp. Form.:
C24H27N3O4S2
Mol. Mass.:
485.619
SMILES:
O=S(=O)(NCc1ccccc1)c1ccc(cc1)S(=O)(=O)N(Cc1ccccn1)C1CCCC1
: