Target
Ubiquitin-conjugating enzyme E2 N
Ligand
BDBM59086
Substrate
Meas. Tech.
Dose Response confirmation of uHTS for the identification of UBC13 Polyubiquitin Inhibitors via a TR-FRET Assay
IC50
1977±103 nM
Citation
 PubChem, PC Dose Response confirmation of uHTS for the identification of UBC13 Polyubiquitin Inhibitors via a TR-FRET Assay PubChem Bioassay (2011)[AID] 
Target
Name:
Ubiquitin-conjugating enzyme E2 N
Synonyms:
BLU UBE2N_HUMAN | ubiquitin-conjugating enzyme E2 N
Type:
PROTEIN
Mol. Mass.:
17137.61
Organism:
Homo sapiens (Human)
Description:
EBI_101440
Residue:
152
  
Inhibitor
Name:
BDBM59086
Synonyms:
1-[N'-[6-[[amino-[[N'-(2-ethylhexyl)amidino]amino]methylene]amino]hexyl]amidino]-2-(2-ethylhexyl)guanidine;hydrochloride 1-[N'-[6-[[azanyl-[[N'-(2-ethylhexyl)carbamimidoyl]amino]methylidene]amino]hexyl]carbamimidoyl]-2-(2-ethylhexyl)guanidine;hydrochloride Alexidine dihydrochloride SMR001233329 | cid_18968508
Type:
Small organic molecule
Emp. Form.:
C26H56N10
Mol. Mass.:
508.7898
SMILES:
CCCCC(CC)CN=C(N)NC(N)=NCCCCCCN=C(N)NC(N)=NCC(CC)CCCC
: