Target
Ubiquitin-conjugating enzyme E2 N
Ligand
BDBM78536
Substrate
Meas. Tech.
Dose Response confirmation of uHTS for the identification of UBC13 Polyubiquitin Inhibitors via a TR-FRET Assay reconfirm
IC50
1987±65 nM
Citation
 PubChem, PC Dose Response confirmation of uHTS for the identification of UBC13 Polyubiquitin Inhibitors via a TR-FRET Assay reconfirm PubChem Bioassay (2011)[AID] 
Target
Name:
Ubiquitin-conjugating enzyme E2 N
Synonyms:
BLU UBE2N_HUMAN | ubiquitin-conjugating enzyme E2 N
Type:
PROTEIN
Mol. Mass.:
17137.61
Organism:
Homo sapiens (Human)
Description:
EBI_101440
Residue:
152
  
Inhibitor
Name:
BDBM78536
Synonyms:
4-(3-butyl-7-cyclopentyl-2,6-diketo-purin-8-yl)benzonitrile 4-(3-butyl-7-cyclopentyl-2,6-dioxopurin-8-yl)benzonitrile MLS000097426 cid_2998815
Type:
Small organic molecule
Emp. Form.:
C21H23N5O2
Mol. Mass.:
377.4396
SMILES:
CCCCn1c2nc(-c3ccc(cc3)C#N)n(C3CCCC3)c2c(=O)[nH]c1=O
: