Target
X-box-binding protein 1
Ligand
BDBM68196
Substrate
Meas. Tech.
XBP1 DR counterscreen for CHOP
IC50
10000±n/a nM
Citation
 PubChem, PC XBP1 DR counterscreen for CHOP PubChem Bioassay (2011)[AID] 
Target
Name:
X-box-binding protein 1
Synonyms:
TREB5 XBP1_HUMAN | XBP2
Type:
Enzyme Catalytic Domain
Mol. Mass.:
28704.14
Organism:
Homo sapiens (Human)
Description:
gi_47678753
Residue:
261
  
Inhibitor
Name:
BDBM68196
Synonyms:
3-[4-[(4-fluorobenzyl)amino]-3-nitro-phenyl]-3-[[2-(1-naphthyl)acetyl]amino]propionamide 3-[4-[(4-fluorophenyl)methylamino]-3-nitrophenyl]-3-[(2-naphthalen-1-ylacetyl)amino]propanamide MLS000420599 cid_16746216
Type:
Small organic molecule
Emp. Form.:
C28H25FN4O4
Mol. Mass.:
500.5209
SMILES:
NC(=O)CC(NC(=O)Cc1cccc2ccccc12)c1ccc(NCc2ccc(F)cc2)c(c1)[N+]([O-])=O
: