Target
DNA damage-inducible transcript 3 protein
Ligand
BDBM68019
Substrate
Meas. Tech.
CHOP dose-response primary assay
IC50
>10000±n/a nM
Citation
 PubChem, PC CHOP dose-response primary assay PubChem Bioassay (2011)[AID] 
Target
Name:
DNA damage-inducible transcript 3 protein
Synonyms:
Chop DDIT3_MOUSE Gadd153
Type:
Enzyme Catalytic Domain
Mol. Mass.:
19175.17
Organism:
Mus musculus
Description:
gi_160707929
Residue:
168
  
Inhibitor
Name:
BDBM68019
Synonyms:
2-Chloro-3-phenylamino-[1,4]naphthoquinone 2-anilino-3-chloronaphthalene-1,4-dione MLS000588884 cid_14161
Type:
Small organic molecule
Emp. Form.:
C16H10ClNO2
Mol. Mass.:
283.709
SMILES:
ClC1=C(Nc2ccccc2)C(=O)c2ccccc2C1=O
: