Target
Caspase-7
Ligand
BDBM33115
Substrate
Meas. Tech.
Dose response assay for dual activators of procaspase-3 and procaspase-7: Absorbance-based biochemical high throughput screening assay to identify activators of procaspase-7
EC50
>85262±n/a nM
Citation
 PubChem, PC Dose response assay for dual activators of procaspase-3 and procaspase-7: Absorbance-based biochemical high throughput screening assay to identify activators of procaspase-7 PubChem Bioassay (2011)[AID] 
Target
Name:
Caspase-7
Synonyms:
Apoptotic protease Mch-3 CASP7 CMH-1 MCH3 | caspase 7, apoptosis-related cysteine peptidase
Type:
Enzyme
Mol. Mass.:
34273.91
Organism:
Homo sapiens (Human)
Description:
P55210
Residue:
303
  
Inhibitor
Name:
BDBM33115
Synonyms:
1,5-diphenyl-3-(phenylcarbonyl)-3a,6a-dihydropyrrolo[3,4-c]pyrazole-4,6-dione 3-benzoyl-1,5-diphenyl-3a,6a-dihydropyrrolo[3,4-c]pyrazole-4,6-dione MLS000573554 cid_2901205
Type:
Small organic molecule
Emp. Form.:
C24H17N3O3
Mol. Mass.:
395.4101
SMILES:
Oc1n(-c2ccccc2)c(=O)c2c([nH]n(-c3ccccc3)c12)C(=O)c1ccccc1
: