Target
Caspase-7
Ligand
BDBM51266
Substrate
Meas. Tech.
Dose response assay for dual activators of procaspase-3 and procaspase-7: Absorbance-based biochemical high throughput screening assay to identify activators of procaspase-7
EC50
>85267±n/a nM
Citation
 PubChem, PC Dose response assay for dual activators of procaspase-3 and procaspase-7: Absorbance-based biochemical high throughput screening assay to identify activators of procaspase-7 PubChem Bioassay (2011)[AID] 
Target
Name:
Caspase-7
Synonyms:
Apoptotic protease Mch-3 CASP7 CMH-1 MCH3 | caspase 7, apoptosis-related cysteine peptidase
Type:
Enzyme
Mol. Mass.:
34273.91
Organism:
Homo sapiens (Human)
Description:
P55210
Residue:
303
  
Inhibitor
Name:
BDBM51266
Synonyms:
3-Benzoyl-5-(2-methoxy-phenyl)-1-phenyl-3a,6a-dihydro-1H-pyrrolo[3,4-c]pyrazole-4,6-dione 3-benzoyl-5-(2-methoxyphenyl)-1-phenyl-3a,6a-dihydropyrrolo[3,4-c]pyrazole-4,6-quinone MLS000769406 cid_3565160
Type:
Small organic molecule
Emp. Form.:
C25H19N3O4
Mol. Mass.:
425.4361
SMILES:
COc1ccccc1-n1c(O)c2n([nH]c(C(=O)c3ccccc3)c2c1=O)-c1ccccc1
: