Target
Caspase-7
Ligand
BDBM71227
Substrate
Meas. Tech.
Dose response assay for dual activators of procaspase-3 and procaspase-7: Absorbance-based biochemical high throughput screening assay to identify activators of procaspase-7
EC50
27775±n/a nM
Citation
 PubChem, PC Dose response assay for dual activators of procaspase-3 and procaspase-7: Absorbance-based biochemical high throughput screening assay to identify activators of procaspase-7 PubChem Bioassay (2011)[AID] 
Target
Name:
Caspase-7
Synonyms:
Apoptotic protease Mch-3 CASP7 CMH-1 MCH3 | caspase 7, apoptosis-related cysteine peptidase
Type:
Enzyme
Mol. Mass.:
34273.91
Organism:
Homo sapiens (Human)
Description:
P55210
Residue:
303
  
Inhibitor
Name:
BDBM71227
Synonyms:
6-Amino-4-(1H-indol-3-yl)-3-methyl-1,4-dihydro-pyrano[2,3-c]pyrazole-5-carbonitrile 6-azanyl-4-(1H-indol-3-yl)-3-methyl-2,4-dihydropyrano[2,3-c]pyrazole-5-carbonitrile SMR000427217 | cid_4994275
Type:
Small organic molecule
Emp. Form.:
C16H13N5O
Mol. Mass.:
291.3073
SMILES:
Cc1[nH]nc2OC(=N)C(C#N)C(c3c[nH]c4ccccc34)c12
: