Target
Epidermal growth factor receptor
Ligand
BDBM270586
Substrate
Meas. Tech.
High Throughput EGFR Biochemical Assay
pH
7±n/a
Temperature
298.15±n/a K
EC50
195±n/a nM
Comments
extracted
Citation
 Balan, GChou, CKim, MKirschberg, TALink, JOPhillips, GSaito, RDSquires, NHTaylor, JGWatkins, WJWright, NE Cot modulators and methods of use thereof US Patent  US10059695 Publication Date 8/28/2018 
Target
Name:
Epidermal growth factor receptor
Synonyms:
EGF Receptor Substrate EGFR_HUMAN ERBB1 Epidermal Growth Factor Receptor erbB-1 Epidermal growth factor receptor (EGFR) HER1 Proto-oncogene c-ErbB-1 Tyrosine-Protein Kinase ErbB-1
Type:
Receptor Kinase Domain
Mol. Mass.:
134279.59
Organism:
Homo sapiens (Human)
Description:
P00533
Residue:
1210
  
Inhibitor
Name:
BDBM270586
Synonyms:
(S)-N6- (benzo[d]thiazol-7- yl(1-(1- (trifluoromethyl) cyclopropyl)-1H-1,2,3- triazol-4-yl)methyl)- 8-bromo-N4- neopentylquinazoline- 4,6-diamine US10577352, Compound I-18
Type:
Small organic molecule
Emp. Form.:
C27H26BrF3N8S
Mol. Mass.:
631.513
SMILES:
CC(C)(C)CNc1ncnc2c(Br)cc(N[C@H](c3cn(nn3)C3(CC3)C(F)(F)F)c3cccc4ncsc34)cc12
: