Target
Epidermal growth factor receptor
Ligand
BDBM270592
Substrate
Meas. Tech.
High Throughput EGFR Biochemical Assay
pH
7±n/a
Temperature
298.15±n/a K
EC50
11.3±n/a nM
Comments
extracted
Citation
 Balan, GChou, CKim, MKirschberg, TALink, JOPhillips, GSaito, RDSquires, NHTaylor, JGWatkins, WJWright, NE Cot modulators and methods of use thereof US Patent  US10059695 Publication Date 8/28/2018 
Target
Name:
Epidermal growth factor receptor
Synonyms:
EGF Receptor Substrate EGFR_HUMAN ERBB1 Epidermal Growth Factor Receptor erbB-1 Epidermal growth factor receptor (EGFR) HER1 Proto-oncogene c-ErbB-1 Tyrosine-Protein Kinase ErbB-1
Type:
Receptor Kinase Domain
Mol. Mass.:
134279.59
Organism:
Homo sapiens (Human)
Description:
P00533
Residue:
1210
  
Inhibitor
Name:
BDBM270592
Synonyms:
(S)-6-(((1-(1- (difluoromethyl) cyclopropyl)-1H-1,2,3- triazol-4-yl)(2- methyl-1-oxo-1,2- dihydroisoquinolin- 5-yl)methyl)amino)- 4- (neopentylamino) quinazoline-8- carbonitrile US10577352, Compound I-24
Type:
Small organic molecule
Emp. Form.:
C31H31F2N9O
Mol. Mass.:
583.6343
SMILES:
Cn1ccc2c(cccc2c1=O)[C@H](Nc1cc(C#N)c2ncnc(NCC(C)(C)C)c2c1)c1cn(nn1)C1(CC1)C(F)F
: