Target
Integrin alpha-L
Ligand
BDBM42661
Substrate
Meas. Tech.
Dose Response of Developing T Cell Immune Modulators with powder sourced compounds
EC50
173±n/a nM
Citation
 PubChem, PC Dose Response of Developing T Cell Immune Modulators with powder sourced compounds PubChem Bioassay (2011)[AID] 
Target
Name:
Integrin alpha-L
Synonyms:
CD11 antigen-like family member A Itgal Leukocyte function-associated molecule 1 alpha chain Ly-15 | Lymphocyte antigen 15
Type:
Enzyme Catalytic Domain
Mol. Mass.:
128317.79
Organism:
Mus musculus
Description:
P24063
Residue:
1163
  
Inhibitor
Name:
BDBM42661
Synonyms:
(6Z)-6-(2-amino-5-phenyl-1H-pyrimidin-6-ylidene)-3-ethoxy-1-cyclohexa-2,4-dienone (6Z)-6-(2-amino-5-phenyl-1H-pyrimidin-6-ylidene)-3-ethoxycyclohexa-2,4-dien-1-one MLS000042426 cid_5390022
Type:
Small organic molecule
Emp. Form.:
C18H17N3O2
Mol. Mass.:
307.3465
SMILES:
CCOc1ccc(c(O)c1)-c1nc(N)ncc1-c1ccccc1
: