Target
Short transient receptor potential channel 4
Ligand
BDBM79618
Substrate
Meas. Tech.
SAR Analysis for the identification of selective inhibits of the transient receptor potential cation channel C4 (TRPC4): Automated Electrophysiology_2
IC50
7540±n/a nM
Citation
 PubChem, PC SAR Analysis for the identification of selective inhibits of the transient receptor potential cation channel C4 (TRPC4): Automated Electrophysiology_2 PubChem Bioassay (2011)[AID] 
Target
Name:
Short transient receptor potential channel 4
Synonyms:
TRPC4_MOUSE Trrp4 | alternatively spliced Trp4
Type:
Enzyme Catalytic Domain
Mol. Mass.:
111587.67
Organism:
Mus musculus
Description:
Q9QUQ5
Residue:
974
  
Inhibitor
Name:
BDBM79618
Synonyms:
N,N-diethyl-4-methyl-2-quinolinamine;2,2,2-trifluoroacetic acid N,N-diethyl-4-methylquinolin-2-amine;2,2,2-trifluoroacetic acid cid_46259337 | diethyl-(4-methyl-2-quinolyl)amine;2,2,2-trifluoroacetic acid
Type:
Small organic molecule
Emp. Form.:
C14H18N2
Mol. Mass.:
214.3061
SMILES:
CCN(CC)c1cc(C)c2ccccc2n1
: