Target
Hexokinase HKDC1 [W721R]
Ligand
BDBM46401
Substrate
Meas. Tech.
Dose Response confirmation of activators of hexokinase domain containing I (HKDC1)
EC50
26500±n/a nM
Citation
 PubChem, PC Dose Response confirmation of activators of hexokinase domain containing I (HKDC1) PubChem Bioassay (2011)[AID] 
Target
Name:
Hexokinase HKDC1 [W721R]
Synonyms:
HKDC1 putative hexokinase HKDC1
Type:
Enzyme Catalytic Domain
Mol. Mass.:
102520.24
Organism:
Homo sapiens (Human)
Description:
gi_156151420
Residue:
917
  
Inhibitor
Name:
BDBM46401
Synonyms:
1-(2-nitrophenyl)-3-[[(E)-(6-oxidanylidene-4-propoxy-cyclohexa-2,4-dien-1-ylidene)methyl]amino]thiourea 1-(2-nitrophenyl)-3-[[(E)-(6-oxo-4-propoxycyclohexa-2,4-dien-1-ylidene)methyl]amino]thiourea MLS000393335 cid_5831714
Type:
Small organic molecule
Emp. Form.:
C17H18N4O4S
Mol. Mass.:
374.414
SMILES:
CCCOc1cc[c-](C=[NH+]NC(=S)Nc2ccccc2[N+]([O-])=O)c(=O)c1
: