Target
Hexokinase HKDC1 [W721R]
Ligand
BDBM80787
Substrate
Meas. Tech.
Dose Response confirmation of activators of hexokinase domain containing I (HKDC1)
EC50
27000±n/a nM
Citation
 PubChem, PC Dose Response confirmation of activators of hexokinase domain containing I (HKDC1) PubChem Bioassay (2011)[AID] 
Target
Name:
Hexokinase HKDC1 [W721R]
Synonyms:
HKDC1 putative hexokinase HKDC1
Type:
Enzyme Catalytic Domain
Mol. Mass.:
102520.24
Organism:
Homo sapiens (Human)
Description:
gi_156151420
Residue:
917
  
Inhibitor
Name:
BDBM80787
Synonyms:
5-(2-fluorophenyl)-N-(2-methylphenyl)-6H-1,3,4-thiadiazin-2-amine SMR000260132 cid_5147972
Type:
Small organic molecule
Emp. Form.:
C16H14FN3S
Mol. Mass.:
299.366
SMILES:
Cc1ccccc1NC1=NN=C(CS1)c1ccccc1F
: