Target
Hexokinase HKDC1 [W721R]
Ligand
BDBM64655
Substrate
Meas. Tech.
Dose Response confirmation of activators of hexokinase domain containing I (HKDC1)
EC50
2200±n/a nM
Citation
 PubChem, PC Dose Response confirmation of activators of hexokinase domain containing I (HKDC1) PubChem Bioassay (2011)[AID] 
Target
Name:
Hexokinase HKDC1 [W721R]
Synonyms:
HKDC1 putative hexokinase HKDC1
Type:
Enzyme Catalytic Domain
Mol. Mass.:
102520.24
Organism:
Homo sapiens (Human)
Description:
gi_156151420
Residue:
917
  
Inhibitor
Name:
BDBM64655
Synonyms:
1-(3,4-dichlorophenyl)-3-(pyridin-2-ylcarbonylamino)thiourea 1-(3,4-dichlorophenyl)-3-[[oxo(2-pyridinyl)methyl]amino]thiourea MLS000662162 SMR000294066 | cid_969982
Type:
Small organic molecule
Emp. Form.:
C13H10Cl2N4OS
Mol. Mass.:
341.216
SMILES:
Clc1ccc(NC(=S)NNC(=O)c2ccccn2)cc1Cl
: