Target
Hexokinase HKDC1 [W721R]
Ligand
BDBM43164
Substrate
Meas. Tech.
Dose Response confirmation of activators of hexokinase domain containing I (HKDC1)
EC50
27600±n/a nM
Citation
 PubChem, PC Dose Response confirmation of activators of hexokinase domain containing I (HKDC1) PubChem Bioassay (2011)[AID] 
Target
Name:
Hexokinase HKDC1 [W721R]
Synonyms:
HKDC1 putative hexokinase HKDC1
Type:
Enzyme Catalytic Domain
Mol. Mass.:
102520.24
Organism:
Homo sapiens (Human)
Description:
gi_156151420
Residue:
917
  
Inhibitor
Name:
BDBM43164
Synonyms:
MLS000711584 N-(3-pyridylmethyleneamino)-2-(8-quinolylthio)acetamide N-(pyridin-3-ylmethylideneamino)-2-quinolin-8-ylsulfanylacetamide cid_775616
Type:
Small organic molecule
Emp. Form.:
C17H14N4OS
Mol. Mass.:
322.384
SMILES:
O=C(CSc1cccc2cccnc12)NN=Cc1cccnc1
: