Target
Hexokinase HKDC1 [W721R]
Ligand
BDBM80793
Substrate
Meas. Tech.
Dose Response confirmation of activators of hexokinase domain containing I (HKDC1)
EC50
39200±n/a nM
Citation
 PubChem, PC Dose Response confirmation of activators of hexokinase domain containing I (HKDC1) PubChem Bioassay (2011)[AID] 
Target
Name:
Hexokinase HKDC1 [W721R]
Synonyms:
HKDC1 putative hexokinase HKDC1
Type:
Enzyme Catalytic Domain
Mol. Mass.:
102520.24
Organism:
Homo sapiens (Human)
Description:
gi_156151420
Residue:
917
  
Inhibitor
Name:
BDBM80793
Synonyms:
3-(1-methyl-2-phenyl-3-indolyl)-3-oxopropanenitrile 3-(1-methyl-2-phenylindol-3-yl)-3-oxopropanenitrile MLS001005254 cid_2404762
Type:
Small organic molecule
Emp. Form.:
C18H14N2O
Mol. Mass.:
274.3166
SMILES:
Cn1c(c(C(=O)CC#N)c2ccccc12)-c1ccccc1
: