Target
Hexokinase HKDC1 [W721R]
Ligand
BDBM66618
Substrate
Meas. Tech.
Dose Response confirmation of activators of hexokinase domain containing I (HKDC1)
EC50
48900±n/a nM
Citation
 PubChem, PC Dose Response confirmation of activators of hexokinase domain containing I (HKDC1) PubChem Bioassay (2011)[AID] 
Target
Name:
Hexokinase HKDC1 [W721R]
Synonyms:
HKDC1 putative hexokinase HKDC1
Type:
Enzyme Catalytic Domain
Mol. Mass.:
102520.24
Organism:
Homo sapiens (Human)
Description:
gi_156151420
Residue:
917
  
Inhibitor
Name:
BDBM66618
Synonyms:
MLS000830340 N-[2-(4-acetylpiperazin-1-yl)-1,2-dihydroacenaphthylen-1-yl]benzenesulfonamide N-[2-(4-ethanoylpiperazin-1-yl)-1,2-dihydroacenaphthylen-1-yl]benzenesulfonamide cid_660189
Type:
Small organic molecule
Emp. Form.:
C24H25N3O3S
Mol. Mass.:
435.539
SMILES:
CC(=O)N1CCN(CC1)C1C(NS(=O)(=O)c2ccccc2)c2cccc3cccc1c23
: