Target
Hexokinase HKDC1 [W721R]
Ligand
BDBM45724
Substrate
Meas. Tech.
Dose Response confirmation of activators of hexokinase domain containing I (HKDC1)
EC50
5620±n/a nM
Citation
 PubChem, PC Dose Response confirmation of activators of hexokinase domain containing I (HKDC1) PubChem Bioassay (2011)[AID] 
Target
Name:
Hexokinase HKDC1 [W721R]
Synonyms:
HKDC1 putative hexokinase HKDC1
Type:
Enzyme Catalytic Domain
Mol. Mass.:
102520.24
Organism:
Homo sapiens (Human)
Description:
gi_156151420
Residue:
917
  
Inhibitor
Name:
BDBM45724
Synonyms:
4-(3-Chloro-1,4-dioxo-1,4-dihydro-naphthalen-2-ylamino)-benzoic acid 4-[(3-chloro-1,4-dioxo-2-naphthalenyl)amino]benzoic acid 4-[[3-chloranyl-1,4-bis(oxidanylidene)naphthalen-2-yl]amino]benzoic acid SMR000414744 | cid_470952
Type:
Small organic molecule
Emp. Form.:
C17H10ClNO4
Mol. Mass.:
327.719
SMILES:
OC(=O)c1ccc(NC2=C(Cl)C(=O)c3ccccc3C2=O)cc1
: