Target
Hexokinase HKDC1 [W721R]
Ligand
BDBM80802
Substrate
Meas. Tech.
Dose Response confirmation of activators of hexokinase domain containing I (HKDC1)
EC50
18300±n/a nM
Citation
 PubChem, PC Dose Response confirmation of activators of hexokinase domain containing I (HKDC1) PubChem Bioassay (2011)[AID] 
Target
Name:
Hexokinase HKDC1 [W721R]
Synonyms:
HKDC1 putative hexokinase HKDC1
Type:
Enzyme Catalytic Domain
Mol. Mass.:
102520.24
Organism:
Homo sapiens (Human)
Description:
gi_156151420
Residue:
917
  
Inhibitor
Name:
BDBM80802
Synonyms:
MLS001212230 N-[1-(phenylmethyl)-2-benzimidazolyl]nitrous amide SMR000514905 cid_2850046
Type:
Small organic molecule
Emp. Form.:
C14H12N4O
Mol. Mass.:
252.2713
SMILES:
O=NNc1nc2ccccc2n1Cc1ccccc1
: