Target
Hexokinase HKDC1 [W721R]
Ligand
BDBM80806
Substrate
Meas. Tech.
Dose Response confirmation of activators of hexokinase domain containing I (HKDC1)
EC50
20400±n/a nM
Citation
 PubChem, PC Dose Response confirmation of activators of hexokinase domain containing I (HKDC1) PubChem Bioassay (2011)[AID] 
Target
Name:
Hexokinase HKDC1 [W721R]
Synonyms:
HKDC1 putative hexokinase HKDC1
Type:
Enzyme Catalytic Domain
Mol. Mass.:
102520.24
Organism:
Homo sapiens (Human)
Description:
gi_156151420
Residue:
917
  
Inhibitor
Name:
BDBM80806
Synonyms:
3-(1,3-diketobenzo[de]isoquinolin-2-yl)propyl-[6-[3-(1,3-diketobenzo[de]isoquinolin-2-yl)propyl-dimethyl-ammonio]hexyl]-dimethyl-ammonium;bromide 3-(1,3-dioxobenzo[de]isoquinolin-2-yl)propyl-[6-[3-(1,3-dioxobenzo[de]isoquinolin-2-yl)propyl-dimethylazaniumyl]hexyl]-dimethylazanium;bromide MLS002172486 WB64 | cid_405251
Type:
Small organic molecule
Emp. Form.:
C40H48N4O4
Mol. Mass.:
648.8324
SMILES:
C[N+](C)(CCCCCC[N+](C)(C)CCCN1C(=O)c2cccc3cccc(C1=O)c23)CCCN1C(=O)c2cccc3cccc(C1=O)c23
: