Target
Hexokinase HKDC1 [W721R]
Ligand
BDBM80816
Substrate
Meas. Tech.
Dose Response confirmation of activators of hexokinase domain containing I (HKDC1)
EC50
212±n/a nM
Citation
 PubChem, PC Dose Response confirmation of activators of hexokinase domain containing I (HKDC1) PubChem Bioassay (2011)[AID] 
Target
Name:
Hexokinase HKDC1 [W721R]
Synonyms:
HKDC1 putative hexokinase HKDC1
Type:
Enzyme Catalytic Domain
Mol. Mass.:
102520.24
Organism:
Homo sapiens (Human)
Description:
gi_156151420
Residue:
917
  
Inhibitor
Name:
BDBM80816
Synonyms:
MLS002702135 cid_325517
Type:
Small organic molecule
Emp. Form.:
C20H26N2O8S2
Mol. Mass.:
486.559
SMILES:
CC1OC2(CC3N4C(=O)C5(CO)SSC4(CC3(O)C2OC(C)=O)C(=O)N5C)C(=O)C1(C)C
: