Target
Hexokinase HKDC1 [W721R]
Ligand
BDBM80818
Substrate
Meas. Tech.
Dose Response confirmation of activators of hexokinase domain containing I (HKDC1)
EC50
615±n/a nM
Citation
 PubChem, PC Dose Response confirmation of activators of hexokinase domain containing I (HKDC1) PubChem Bioassay (2011)[AID] 
Target
Name:
Hexokinase HKDC1 [W721R]
Synonyms:
HKDC1 putative hexokinase HKDC1
Type:
Enzyme Catalytic Domain
Mol. Mass.:
102520.24
Organism:
Homo sapiens (Human)
Description:
gi_156151420
Residue:
917
  
Inhibitor
Name:
BDBM80818
Synonyms:
1-(3-chlorophenyl)-3-(1-pyridin-2-ylethylideneamino)thiourea 1-(3-chlorophenyl)-3-[1-(2-pyridyl)ethylideneamino]thiourea SMR001565771 | cid_3005734
Type:
Small organic molecule
Emp. Form.:
C14H13ClN4S
Mol. Mass.:
304.798
SMILES:
CC(=NNC(=S)Nc1cccc(Cl)c1)c1ccccn1
: