Target
Hexokinase-1
Ligand
BDBM80794
Substrate
Meas. Tech.
Dose Response confirmation of activators of hexokinase domain containing I (HKDC1) in the hexokinase 1 selectivity assay
EC50
34500±n/a nM
Citation
 PubChem, PC Dose Response confirmation of activators of hexokinase domain containing I (HKDC1) in the hexokinase 1 selectivity assay PubChem Bioassay (2011)[AID] 
Target
Name:
Hexokinase-1
Synonyms:
Brain form hexokinase HK1 Hexokinase type I hexokinase-1 isoform HKI
Type:
PROTEIN
Mol. Mass.:
102488.34
Organism:
Homo sapiens (Human)
Description:
EBI_11382
Residue:
917
  
Inhibitor
Name:
BDBM80794
Synonyms:
5-[1-(2-methoxyethyl)-2,5-dimethyl-3-pyrrolyl]-N-[4-(4-morpholinylsulfonyl)phenyl]-6H-1,3,4-thiadiazin-2-amine 5-[1-(2-methoxyethyl)-2,5-dimethylpyrrol-3-yl]-N-(4-morpholin-4-ylsulfonylphenyl)-6H-1,3,4-thiadiazin-2-amine SMR000370725 cid_3579984
Type:
Small organic molecule
Emp. Form.:
C22H29N5O4S2
Mol. Mass.:
491.627
SMILES:
COCCn1c(C)cc(c1C)C1=NN=C(Nc2ccc(cc2)S(=O)(=O)N2CCOCC2)SC1
: