Target
Hexokinase-1
Ligand
BDBM80795
Substrate
Meas. Tech.
Dose Response confirmation of activators of hexokinase domain containing I (HKDC1) in the hexokinase 1 selectivity assay
EC50
29500±n/a nM
Citation
 PubChem, PC Dose Response confirmation of activators of hexokinase domain containing I (HKDC1) in the hexokinase 1 selectivity assay PubChem Bioassay (2011)[AID] 
Target
Name:
Hexokinase-1
Synonyms:
Brain form hexokinase HK1 Hexokinase type I hexokinase-1 isoform HKI
Type:
PROTEIN
Mol. Mass.:
102488.34
Organism:
Homo sapiens (Human)
Description:
EBI_11382
Residue:
917
  
Inhibitor
Name:
BDBM80795
Synonyms:
5-[2,5-dimethyl-1-(2-oxolanylmethyl)-3-pyrrolyl]-N-[4-(4-morpholinylsulfonyl)phenyl]-6H-1,3,4-thiadiazin-2-amine MLS001002761 [5-[2,5-dimethyl-1-(tetrahydrofurfuryl)pyrrol-3-yl]-6H-1,3,4-thiadiazin-2-yl]-(4-morpholinosulfonylphenyl)amine | cid_4286294
Type:
Small organic molecule
Emp. Form.:
C24H31N5O4S2
Mol. Mass.:
517.664
SMILES:
Cc1cc(c(C)n1CC1CCCO1)C1=NN=C(Nc2ccc(cc2)S(=O)(=O)N2CCOCC2)SC1
: