Target
Hexokinase-1
Ligand
BDBM80821
Substrate
Meas. Tech.
Dose Response confirmation of activators of hexokinase domain containing I (HKDC1) in the hexokinase 1 selectivity assay
EC50
>80000±n/a nM
Citation
 PubChem, PC Dose Response confirmation of activators of hexokinase domain containing I (HKDC1) in the hexokinase 1 selectivity assay PubChem Bioassay (2011)[AID] 
Target
Name:
Hexokinase-1
Synonyms:
Brain form hexokinase HK1 Hexokinase type I hexokinase-1 isoform HKI
Type:
PROTEIN
Mol. Mass.:
102488.34
Organism:
Homo sapiens (Human)
Description:
EBI_11382
Residue:
917
  
Inhibitor
Name:
BDBM80821
Synonyms:
MLS002702263 N-[1-(6-methyl-2-pyridyl)ethylideneamino]piperidine-1-carbothioamide SMR001565825 | cid_3005792
Type:
Small organic molecule
Emp. Form.:
C14H20N4S
Mol. Mass.:
276.4
SMILES:
CC(=NNC(=S)N1CCCCC1)c1cccc(C)n1
: