Target
Hexokinase HKDC1 [W721R]
Ligand
BDBM80736
Substrate
Meas. Tech.
Dose Response confirmation of inhibitors of hexokinase domain containing I (HKDC1) in the hexokinase 1 selectivity assay
IC50
2150±n/a nM
Citation
 PubChem, PC Dose Response confirmation of inhibitors of hexokinase domain containing I (HKDC1) in the hexokinase 1 selectivity assay PubChem Bioassay (2011)[AID] 
Target
Name:
Hexokinase HKDC1 [W721R]
Synonyms:
HKDC1 putative hexokinase HKDC1
Type:
Enzyme Catalytic Domain
Mol. Mass.:
102520.24
Organism:
Homo sapiens (Human)
Description:
gi_156151420
Residue:
917
  
Inhibitor
Name:
BDBM80736
Synonyms:
4-[[1-oxo-2-[[6-(2-pyridinyl)-3-pyridazinyl]thio]ethyl]amino]benzoic acid ethyl ester MLS001237525 cid_16019317 ethyl 4-[[2-(6-pyridin-2-ylpyridazin-3-yl)sulfanylacetyl]amino]benzoate
Type:
Small organic molecule
Emp. Form.:
C20H18N4O3S
Mol. Mass.:
394.447
SMILES:
CCOC(=O)c1ccc(NC(=O)CSc2ccc(nn2)-c2ccccn2)cc1
: