Target
Serine/threonine-protein kinase PAK 6
Ligand
BDBM81374
Substrate
Meas. Tech.
In Vitro Activity Assay
pH
7.5±0
Kd
>1000±0 nM
Citation
 Ranjitkar, PBrock, AMMaly, DJ Affinity reagents that target a specific inactive form of protein kinases. Chem Biol 17:195-206 (2010)  
Target
Name:
Serine/threonine-protein kinase PAK 6
Synonyms:
PAK5 PAK6_HUMAN Serine/threonine-protein kinase PAK6
Type:
PROTEIN
Mol. Mass.:
74897.61
Organism:
Homo sapiens (Human)
Description:
ChEMBL_1513397
Residue:
681
  
Inhibitor
Name:
BDBM81374
Synonyms:
BODIPY-labeled probe, 4a
Type:
Small organic molecule
Emp. Form.:
C50H49BF4N11O4
Mol. Mass.:
954.799
SMILES:
Cc1cc(C)n2B(F)[N+]3=C(CCC(=O)NCCCCC(=O)NCCOc4ccc(Nc5ncnc(n5)-c5cccnc5Nc5cc(NC(=O)c6cccc(c6)C(F)(F)F)ccc5C)cc4)C=CC3=Cc12
: