Target
Tyrosine-protein kinase Lck
Ligand
BDBM81375
Substrate
Meas. Tech.
In Vitro Activity Assay
pH
7.5±0
IC50
<10±0 nM
Citation
 Ranjitkar, PBrock, AMMaly, DJ Affinity reagents that target a specific inactive form of protein kinases. Chem Biol 17:195-206 (2010)  
Target
Name:
Tyrosine-protein kinase Lck
Synonyms:
2.7.10.2 LCK_HUMAN Leukocyte C-terminal Src kinase Lymphocyte-specific protein tyrosine kinase Protein YT16 Proto-oncogene tyrosine-protein kinase LCK T cell-specific protein-tyrosine kinase
Type:
Mol. Mass.:
57987.83
Organism:
Homo sapiens (Human)
Description:
P06239
Residue:
509
  
Inhibitor
Name:
BDBM81375
Synonyms:
Amine compound, 12a
Type:
Small organic molecule
Emp. Form.:
C41H46F3N9O7
Mol. Mass.:
833.8552
SMILES:
Cc1ccc(NC(=O)c2cccc(c2)C(F)(F)F)cc1Nc1ncccc1-c1ncnc(Nc2ccc(OCCNC(=O)COCCOCCOCCOCCN)cc2)n1
: