Target
Interleukin-1 receptor-associated kinase 4
Ligand
BDBM81375
Substrate
Meas. Tech.
In Vitro Activity Assay
pH
7.5±0
IC50
>10000±0 nM
Citation
 Ranjitkar, PBrock, AMMaly, DJ Affinity reagents that target a specific inactive form of protein kinases. Chem Biol 17:195-206 (2010)  
Target
Name:
Interleukin-1 receptor-associated kinase 4
Synonyms:
IRAK-4 IRAK4_HUMAN Interleukin-1 receptor-associated kinase 4 (IRAK4) | Renal carcinoma antigen NY-REN-64
Type:
Protein
Mol. Mass.:
51519.08
Organism:
Homo sapiens (Human)
Description:
Q9NWZ3
Residue:
460
  
Inhibitor
Name:
BDBM81375
Synonyms:
Amine compound, 12a
Type:
Small organic molecule
Emp. Form.:
C41H46F3N9O7
Mol. Mass.:
833.8552
SMILES:
Cc1ccc(NC(=O)c2cccc(c2)C(F)(F)F)cc1Nc1ncccc1-c1ncnc(Nc2ccc(OCCNC(=O)COCCOCCOCCOCCN)cc2)n1
: