Target
Cyclin-dependent kinase 9
Ligand
BDBM81430
Substrate
Meas. Tech.
In Vitro Kinase Assay
Ki
0.80±0.79 nM
Citation
 Wang, SGriffiths, GMidgley, CABarnett, ALCooper, MGrabarek, JIngram, LJackson, WKontopidis, GMcClue, SJMcInnes, CMcLachlan, JMeades, CMezna, MStuart, IThomas, MPZheleva, DILane, DPJackson, RCGlover, DMBlake, DGFischer, PM Discovery and characterization of 2-anilino-4- (thiazol-5-yl)pyrimidine transcriptional CDK inhibitors as anticancer agents. Chem Biol 17:1111-21 (2010)  
Target
Name:
Cyclin-dependent kinase 9
Synonyms:
C-2K CDK9 Cell division cycle 2-like protein kinase 4 Cyclin-Dependent Kinase 9 (CDK9) Serine/threonine-protein kinase PITALRE Tat-associated kinase complex catalytic subunit
Type:
Enzyme Subunit
Mol. Mass.:
42789.13
Organism:
Homo sapiens (Human)
Description:
Residue:
372
  
Inhibitor
Name:
BDBM81430
Synonyms:
CDK Inhibitor, 3
Type:
Small organic molecule
Emp. Form.:
C15H16N6O2S2
Mol. Mass.:
376.457
SMILES:
CNc1nc(C)c(s1)-c1ccnc(Nc2cccc(c2)S(N)(=O)=O)n1
: