Target
5-hydroxytryptamine receptor 7
Ligand
BDBM50000690
Substrate
Ki
>10000±n/a nM
Comments
PDSP_1928
Citation
 Greenberg, DAPrichard, DCSnyder, SH Alpha-noradrenergic receptor binding in mammalian brain: differential labeling of agonist and antagonist states. Life Sci 19:69-76 (1976)  
Target
Name:
5-hydroxytryptamine receptor 7
Synonyms:
5-HT-7 5-HT7 5-HT7S 5-hydroxytryptamine receptor 7 5HT7R_RAT GPRFO Serotonin (5-HT) receptor | Serotonin Receptor 7
Type:
G Protein-Coupled Receptor (GPCR)
Mol. Mass.:
49852.62
Organism:
Rattus norvegicus (rat)
Description:
Rat cloned 5-HT7R.
Residue:
448
  
Inhibitor
Name:
BDBM50000690
Synonyms:
10,25-dimethoxy-15,15,30-trimethyl-(1S,16R)-7,23-dioxa-15,30-diazoniaheptacyclo[22.6.2.23,6.112,16.118,22.08,36.027,31]hexatriaconta-3,5,8,10,12(36),18,20,22(35),24(32),25,27(31),33-dodecaene-9,21-diol,dichloride(tubocurarine) Tubocurarine Tubocurarine,d
Type:
Small organic molecule
Emp. Form.:
C37H42N2O6
Mol. Mass.:
610.7381
SMILES:
COc1cc2CC[N+](C)(C)[C@@H]3Cc4ccc(O)c(Oc5cc6[C@H](Cc7ccc(Oc(c1O)c23)cc7)[NH+](C)CCc6cc5OC)c4
: