Target
Histamine H1 receptor
Ligand
BDBM50017666
Substrate
Ki
4.7±n/a nM
Comments
PDSP_612
Citation
 Tran, VTChang, RSSnyder, SH Histamine H1 receptors identified in mammalian brain membranes with [3H]mepyramine. Proc Natl Acad Sci U S A 75:6290-4 (1978)  
Target
Name:
Histamine H1 receptor
Synonyms:
HISTAMINE H1 Hrh1
Type:
Enzyme Catalytic Domain
Mol. Mass.:
55716.35
Organism:
RAT
Description:
HISTAMINE H1 HRH1 RAT::P31390
Residue:
486
  
Inhibitor
Name:
BDBM50017666
Synonyms:
1-(p-bromophenyl)-1-(2-pyridyl)-3-dimethylaminopropane 3-(4-bromophenyl)-N,N-dimethyl-3-(2-pyridinyl)-1-propanamine 3-(p-bromophenyl)-3-(2-pyridyl)-N,N-dimethylpropylamine CHEMBL811
Type:
Small organic molecule
Emp. Form.:
C16H19BrN2
Mol. Mass.:
319.239
SMILES:
CN(C)CCC(c1ccc(Br)cc1)c1ccccn1
: