Target
Gamma-aminobutyric acid type B receptor subunit 1
Ligand
BDBM81475
Substrate
Ki
>10000±n/a nM
Comments
PDSP_366
Citation
 Williams, MRisley, EA Characterization of the binding of [3H]muscimol, a potent gamma-aminobutyric acid agonist, to rat brain synaptosomal membranes using a filtration assay. J Neurochem 32:713-8 (1979)  
Target
Name:
Gamma-aminobutyric acid type B receptor subunit 1
Synonyms:
GABA B GABA uptake GABA-B-R1 GABABR1 Gabbr1 | Gb1
Type:
Enzyme Catalytic Domain
Mol. Mass.:
111548.69
Organism:
Rattus norvegicus (Rat)
Description:
Q9Z0U4
Residue:
991
  
Inhibitor
Name:
BDBM81475
Synonyms:
Bicuculline methochloride,(+/-) NSC_123659
Type:
Small organic molecule
Emp. Form.:
C22H22NO6
Mol. Mass.:
396.4126
SMILES:
CC1(OC(=O)c2c3OCOc3ccc12)C1c2cc3OCOc3cc2CC[N+]1(C)C
: