Target
Gamma-aminobutyric acid type B receptor subunit 1
Ligand
BDBM81480
Substrate
Ki
48±n/a nM
Comments
PDSP_2667
Citation
 Herschel, MBaldessarini, RJ Evidence for two types of binding of 3H-gaba and 3H-muscimol in rat cerebral cortex and cerebellum. Life Sci 24:1849-54 (1979)  
Target
Name:
Gamma-aminobutyric acid type B receptor subunit 1
Synonyms:
GABA B GABA uptake GABA-B-R1 GABABR1 Gabbr1 | Gb1
Type:
Enzyme Catalytic Domain
Mol. Mass.:
111548.69
Organism:
Rattus norvegicus (Rat)
Description:
Q9Z0U4
Residue:
991
  
Inhibitor
Name:
BDBM81480
Synonyms:
CAS_118-96-7 NSC_5590 Triton,(-)
Type:
Small organic molecule
Emp. Form.:
C16H26O2
Mol. Mass.:
250.3764
SMILES:
CC(C)(C)CC(C)(C)c1ccc(OCCO)cc1
: