Target
D(1A) dopamine receptor
Ligand
BDBM81492
Substrate
Ki
4100±n/a nM
Comments
PDSP_346
Citation
 Burt, DRCreese, ISnyder, SH Properties of [3H]haloperidol and [3H]dopamine binding associated with dopamine receptors in calf brain membranes. Mol Pharmacol 12:800-12 (1976) Target
Name:
D(1A) dopamine receptor
Synonyms:
D(1A) dopamine receptor DOPAMINE D1 DRD1_BOVIN | Dopamine receptor
Type:
Enzyme Catalytic Domain
Mol. Mass.:
49330.65
Organism:
BOVINE
Description:
DOPAMINE D1 DRD1 BOVINE::Q95136
Residue:
446
  
Inhibitor
Name:
BDBM81492
Synonyms:
BENPERIDOL NSC_16363
Type:
Small organic molecule
Emp. Form.:
C22H24FN3O2
Mol. Mass.:
381.4433
SMILES:
Fc1ccc(cc1)C(=O)CCCN1CCC(CC1)n1c2ccccc2[nH]c1=O
: