Target
D(2) dopamine receptor
Ligand
BDBM50855
Substrate
Ki
1.3±n/a nM
Comments
PDSP_2788
Citation
 Burt, DRCreese, ISnyder, SH Properties of [3H]haloperidol and [3H]dopamine binding associated with dopamine receptors in calf brain membranes. Mol Pharmacol 12:800-12 (1976) Target
Name:
D(2) dopamine receptor
Synonyms:
DOPAMINE D2 DRD2_BOVIN | Dopamine D2 receptor
Type:
Enzyme Catalytic Domain
Mol. Mass.:
50698.79
Organism:
BOVINE
Description:
P20288
Residue:
444
  
Inhibitor
Name:
BDBM50855
Synonyms:
ALPHA-ERGOCRYPTINE SMR000058703 | cid_6852403
Type:
Small organic molecule
Emp. Form.:
C32H41N5O5
Mol. Mass.:
575.6984
SMILES:
CC(C)C[C@@H]1N2C(=O)[C@](NC(=O)[C@H]3CN(C)C4Cc5c[nH]c6cccc(C4=C3)c56)(O[C@@]2(O)C2CCCN2C1=O)C(C)C
: