Target
Muscarinic acetylcholine receptor M2
Ligand
BDBM81496
Substrate
Ki
>10000±n/a nM
Comments
PDSP_1985
Citation
 Wei, HBRoeske, WRLai, JWanibuchi, FHidaka, KUsuda, SYamamura, HI Pharmacological characterization of a novel muscarinic partial agonist, YM796, in transfected cells expressing the m1 or m2 muscarinic receptor gene. Life Sci 50:355-63 (1992)  
Target
Name:
Muscarinic acetylcholine receptor M2
Synonyms:
ACM2_RAT Chrm-2 | Chrm2
Type:
Enzyme Catalytic Domain
Mol. Mass.:
51555.53
Organism:
RAT
Description:
P10980
Residue:
466
  
Inhibitor
Name:
BDBM81496
Synonyms:
YM796(+)
Type:
Small organic molecule
Emp. Form.:
C11H19NO
Mol. Mass.:
181.2747
SMILES:
C[C@H]1OC2(CC1=C)CCN(C)CC2
: