Target
Pituitary adenylate cyclase-activating polypeptide
Ligand
BDBM81538
Substrate
Ki
100±n/a nM
Comments
PDSP_2352
Citation
 Robberecht, PGourlet, PDe Neef, PWoussen-Colle, MCVandermeers-Piret, MCVandermeers, AChristophe, J Structural requirements for the occupancy of pituitary adenylate-cyclase-activating-peptide (PACAP) receptors and adenylate cyclase activation in human neuroblastoma NB-OK-1 cell membranes. Discovery of PACAP(6-38) as a potent antagonist. Eur J Biochem 207:239-46 (1992)  
Target
Name:
Pituitary adenylate cyclase-activating polypeptide
Synonyms:
ADCYAP1 PACA_HUMAN | Pituitary adenylate cyclase-activating polypeptide
Type:
Enzyme Catalytic Domain
Mol. Mass.:
18847.28
Organism:
Homo sapiens (Human)
Description:
PACAP 0 HUMAN::P18509
Residue:
176
  
Inhibitor
Name:
BDBM81538
Synonyms:
[AcHis1,Phe2]PACAP(1-27)
Type:
Small organic molecule
Emp. Form.:
C150H230N40O39S
Mol. Mass.:
3249.741
SMILES:
CCC(C)[C@H](NC(=O)CNC(=O)[C@H](CC(O)=O)NC(=O)[C@H](Cc1ccccc1)NC(=O)[C@H](Cc1cnc[nH]1)NC(C)=O)C(=O)N[C@@H](Cc1ccccc1)C(=O)N[C@@H]([C@@H](C)O)C(=O)N[C@@H](CC(O)=O)C(=O)N[C@@H](CO)C(=O)N[C@@H](Cc1ccc(O)cc1)C(=O)N[C@@H](CO)C(=O)N[C@@H](CCCN=C(N)N)C(=O)N[C@@H](Cc1ccc(O)cc1)C(=O)N[C@@H](CCCN=C(N)N)C(=O)N[C@@H](CCCCN)C(=O)N[C@@H](CCC(N)=O)C(=O)N[C@@H](CCSC)C(=O)N[C@@H](C)C(=O)N[C@@H](C(C)C)C(=O)N[C@@H](CCCCN)C(=O)N[C@@H](CCCCN)C(=O)N[C@@H](Cc1ccc(O)cc1)C(=O)N[C@@H](CC(C)C)C(=O)N[C@@H](C)C(=O)N[C@@H](C)C(=O)N[C@@H](C(C)C)C(=O)N[C@@H](CC(C)C)C(N)=O
: