Target
Histamine H1 receptor
Ligand
BDBM22904
Substrate
Ki
0.5±n/a nM
Comments
PDSP_272
Citation
 Hill, SJ Multiple histamine receptors: properties and functional characteristics. Biochem Soc Trans 20:122-5 (1992)  
Target
Name:
Histamine H1 receptor
Synonyms:
HISTAMINE H1 HRH1_CAVPO
Type:
G Protein-Coupled Receptor (GPCR)
Mol. Mass.:
55641.53
Organism:
Cavia porcellus (domestic guinea pig)
Description:
Guinea pig cerebellum was used in binding assay.
Residue:
488
  
Inhibitor
Name:
BDBM22904
Synonyms:
(2R)-1-(1H-imidazol-5-yl)propan-2-amine Alpha-Methylhistamine-R CHEMBL268229 RAMH
Type:
Small organic molecule
Emp. Form.:
C6H11N3
Mol. Mass.:
125.1716
SMILES:
C[C@@H](N)Cc1cnc[nH]1
: