Target
Histamine H1 receptor
Ligand
BDBM81542
Substrate
Ki
0.8±n/a nM
Comments
PDSP_359
Citation
 Hill, SJ Multiple histamine receptors: properties and functional characteristics. Biochem Soc Trans 20:122-5 (1992)  
Target
Name:
Histamine H1 receptor
Synonyms:
HISTAMINE H1 HRH1_CAVPO
Type:
G Protein-Coupled Receptor (GPCR)
Mol. Mass.:
55641.53
Organism:
Cavia porcellus (domestic guinea pig)
Description:
Guinea pig cerebellum was used in binding assay.
Residue:
488
  
Inhibitor
Name:
BDBM81542
Synonyms:
Beta-Methylhistamine NSC_565544
Type:
Small organic molecule
Emp. Form.:
C6H11N3
Mol. Mass.:
125.1716
SMILES:
CC(CN)c1cnc[nH]1
: