Target
Cannabinoid receptor 2
Ligand
BDBM50160434
Substrate
Meas. Tech.
Binding Assay
Ki
35.8±9 nM
Citation
 Schuehly, WParedes, JMKleyer, JHuefner, AAnavi-Goffer, SRaduner, SAltmann, KHGertsch, J Mechanisms of Osteoclastogenesis Inhibition by a Novel Class of Biphenyl-Type Cannabinoid CB(2) Receptor Inverse Agonists. Chem Biol 18:1053-64 (2011)  
Target
Name:
Cannabinoid receptor 2
Synonyms:
CANNABINOID CB2 CB2 CB2B CNR2_HUMAN Cannabinoid CB2 receptor Cannabinoid receptor 2 (CB2R) | hCB2
Type:
G Protein-Coupled Receptor (GPCR)
Mol. Mass.:
39690.94
Organism:
Homo sapiens (Human)
Description:
P34972
Residue:
360
  
Inhibitor
Name:
BDBM50160434
Synonyms:
(6-iodo-2-methyl-1-(2-morpholinoethyl)-1H-indol-3-yl)(4-methoxyphenyl)methanone AM630 [6-iodo-2-methyl-1-(2-morpholin-4-ylethyl)indol-3-yl]-(4-methoxyphenyl)methanone | {6-iodo-2-methyl-1-[2-(4-morpholinyl)ethyl]-1H-indol-3-yl}[4-(methyloxy)phenyl]methanone
Type:
Small organic molecule
Emp. Form.:
C23H25IN2O3
Mol. Mass.:
504.3607
SMILES:
COc1ccc(cc1)C(=O)c1c(C)n(CCN2CCOCC2)c2cc(I)ccc12
: