Target
Urokinase-type plasminogen activator
Ligand
BDBM81595
Substrate
Meas. Tech.
Inhibition Assay
Ki
2.4e+3± 2e+2 nM
Citation
 Heynekamp, JJHunsaker, LAVander Jagt, TADeck, LMVander Jagt, DL Uncharged isocoumarin-based inhibitors of urokinase-type plasminogen activator. BMC Chem Biol 6:1 (2006)  
Target
Name:
Urokinase-type plasminogen activator
Synonyms:
PLAU UROK_HUMAN Urokinase-type plasminogen activator (uPA) | Urokinase-type plasminogen activator/surface receptor
Type:
Enzyme
Mol. Mass.:
48528.62
Organism:
Homo sapiens (Human)
Description:
P00749
Residue:
431
  
Inhibitor
Name:
BDBM81595
Synonyms:
Isocoumarin, 4b
Type:
Small organic molecule
Emp. Form.:
C12H9BrClNO5
Mol. Mass.:
362.561
SMILES:
Clc1c(OCCCBr)oc(=O)c2cc(ccc12)N(=O)=O
: